Target
Motilin receptor
Ligand
BDBM50199349
Substrate
Meas. Tech.
ChEMBL_411464 (CHEMBL853861)
Ki
701±n/a nM
Citation
 Marsault, EHoveyda, HRPeterson, MLSaint-Louis, CLandry, AVézina, MOuellet, LWang, ZRamaseshan, MBeaubien, SBenakli, KBeauchemin, SDéziel, RPeeters, TFraser, GL Discovery of a new class of macrocyclic antagonists to the human motilin receptor. J Med Chem 49:7190-7 (2006)  
Target
Name:
Motilin receptor
Synonyms:
G-protein coupled receptor 38 MLNR MTLR1 | MTLR_HUMAN
Type:
PROTEIN
Mol. Mass.:
45365.95
Organism:
Homo sapiens (Human)
Description:
ChEMBL_122664
Residue:
412
  
Inhibitor
Name:
BDBM50199349
Synonyms:
(E)-(3S,6R,9R)-9-(4-hydroxy-benzyl)-6-isopropyl-3-propyl-1,4,7,10tetraaza-cyclopentadec-12-ene-2,5,8-trione | CHEMBL214555
Type:
Small organic molecule
Emp. Form.:
C24H36N4O4
Mol. Mass.:
444.567
SMILES:
CCC[C@@H]1NC(=O)[C@H](NC(=O)[C@@H](Cc2ccc(O)cc2)NC\C=C\CCNC1=O)C(C)C
: