Target
cAMP-specific 3',5'-cyclic phosphodiesterase 4D
Ligand
BDBM50202531
Substrate
Meas. Tech.
ChEMBL_423730 (CHEMBL855489)
IC50
9±n/a nM
Citation
 Duplantier, AJBachert, ELCheng, JBCohan, VLJenkinson, THKraus, KGMcKechney, MWPillar, JDWatson, JW SAR of a series of 5,6-dihydro-(9H)-pyrazolo[3,4-c]-1,2,4-triazolo[4,3-alpha]pyridines as potent inhibitors of human eosinophil phosphodiesterase. J Med Chem 50:344-9 (2007)  
Target
Name:
cAMP-specific 3',5'-cyclic phosphodiesterase 4D
Synonyms:
3',5'-cyclic phosphodiesterase PDE43 PDE4D_HUMAN | Phosphodiesterase 4D
Type:
Protein
Mol. Mass.:
91092.69
Organism:
Homo sapiens (Human)
Description:
Q08499
Residue:
809
  
Inhibitor
Name:
BDBM50202531
Synonyms:
9-cyclopentyl-5,6-dihydro-7-ethyl-3-(tert-butyl)-9H-pyrazolo-[3,4-c]-1,2,4-triazolo[4,3-alpha]pyridine | CHEMBL218103
Type:
Small organic molecule
Emp. Form.:
C18H27N5
Mol. Mass.:
313.4405
SMILES:
CCc1nn(C2CCCC2)c-2c1CCn1c-2nnc1C(C)(C)C
: