Target
cAMP-specific 3',5'-cyclic phosphodiesterase 4A
Ligand
BDBM50202530
Substrate
Meas. Tech.
ChEMBL_423728 (CHEMBL855487)
IC50
250±n/a nM
Citation
 Duplantier, AJBachert, ELCheng, JBCohan, VLJenkinson, THKraus, KGMcKechney, MWPillar, JDWatson, JW SAR of a series of 5,6-dihydro-(9H)-pyrazolo[3,4-c]-1,2,4-triazolo[4,3-alpha]pyridines as potent inhibitors of human eosinophil phosphodiesterase. J Med Chem 50:344-9 (2007)  
Target
Name:
cAMP-specific 3',5'-cyclic phosphodiesterase 4A
Synonyms:
3',5'-cyclic phosphodiesterase PDE46 PDE4A_HUMAN Phosphodiesterase 4A | Phosphodiesterase 4A (PDE4)
Type:
Enzyme
Mol. Mass.:
98113.27
Organism:
Homo sapiens (Human)
Description:
P27815
Residue:
886
  
Inhibitor
Name:
BDBM50202530
Synonyms:
9-cyclopentyl-5,6-dihydro-7-ethyl-3-(3-pyridyl)-9H-pyrazolo[3,4-c]-1,2,4-triazolo[4,3-alpha]pyridine | CHEMBL218990
Type:
Small organic molecule
Emp. Form.:
C19H22N6
Mol. Mass.:
334.4182
SMILES:
CCc1nn(C2CCCC2)c-2c1CCn1c-2nnc1-c1cccnc1
: