Target
cAMP-specific 3',5'-cyclic phosphodiesterase 4C
Ligand
BDBM50202530
Substrate
Meas. Tech.
ChEMBL_423729 (CHEMBL855488)
IC50
700±n/a nM
Citation
 Duplantier, AJBachert, ELCheng, JBCohan, VLJenkinson, THKraus, KGMcKechney, MWPillar, JDWatson, JW SAR of a series of 5,6-dihydro-(9H)-pyrazolo[3,4-c]-1,2,4-triazolo[4,3-alpha]pyridines as potent inhibitors of human eosinophil phosphodiesterase. J Med Chem 50:344-9 (2007)  
Target
Name:
cAMP-specific 3',5'-cyclic phosphodiesterase 4C
Synonyms:
3',5'-cyclic phosphodiesterase NP_000914.2 PDE4C | PDE4C1
Type:
Enzyme Catalytic Domain
Mol. Mass.:
79875.54
Organism:
Homo sapiens (Human)
Description:
Q08493
Residue:
712
  
Inhibitor
Name:
BDBM50202530
Synonyms:
9-cyclopentyl-5,6-dihydro-7-ethyl-3-(3-pyridyl)-9H-pyrazolo[3,4-c]-1,2,4-triazolo[4,3-alpha]pyridine | CHEMBL218990
Type:
Small organic molecule
Emp. Form.:
C19H22N6
Mol. Mass.:
334.4182
SMILES:
CCc1nn(C2CCCC2)c-2c1CCn1c-2nnc1-c1cccnc1
: