Target
cAMP-specific 3',5'-cyclic phosphodiesterase 4A
Ligand
BDBM14775
Substrate
Meas. Tech.
ChEMBL_423728 (CHEMBL855487)
IC50
4±n/a nM
Citation
 Duplantier, AJBachert, ELCheng, JBCohan, VLJenkinson, THKraus, KGMcKechney, MWPillar, JDWatson, JW SAR of a series of 5,6-dihydro-(9H)-pyrazolo[3,4-c]-1,2,4-triazolo[4,3-alpha]pyridines as potent inhibitors of human eosinophil phosphodiesterase. J Med Chem 50:344-9 (2007)  
Target
Name:
cAMP-specific 3',5'-cyclic phosphodiesterase 4A
Synonyms:
3',5'-cyclic phosphodiesterase PDE46 PDE4A_HUMAN Phosphodiesterase 4A | Phosphodiesterase 4A (PDE4)
Type:
Enzyme
Mol. Mass.:
98113.27
Organism:
Homo sapiens (Human)
Description:
P27815
Residue:
886
  
Inhibitor
Name:
BDBM14775
Synonyms:
3-(cyclopentyloxy)-N-(3,5-dichloropyridin-4-yl)-4-methoxybenzamide CHEMBL42126 Piclamilast | RPR-73401
Type:
Small organic molecule
Emp. Form.:
C18H18Cl2N2O3
Mol. Mass.:
381.253
SMILES:
COc1ccc(cc1OC1CCCC1)C(=O)Nc1c(Cl)cncc1Cl
: