Target
cAMP-specific 3',5'-cyclic phosphodiesterase 4B
Ligand
BDBM50202532
Substrate
Meas. Tech.
ChEMBL_423727 (CHEMBL855486)
IC50
430±n/a nM
Citation
 Duplantier, AJBachert, ELCheng, JBCohan, VLJenkinson, THKraus, KGMcKechney, MWPillar, JDWatson, JW SAR of a series of 5,6-dihydro-(9H)-pyrazolo[3,4-c]-1,2,4-triazolo[4,3-alpha]pyridines as potent inhibitors of human eosinophil phosphodiesterase. J Med Chem 50:344-9 (2007)  
Target
Name:
cAMP-specific 3',5'-cyclic phosphodiesterase 4B
Synonyms:
3',5'-cyclic phosphodiesterase Isoform PDE4B1 PDE4B PDE4B_HUMAN Phosphodiesterase 4B (PDE4B) Phosphodiesterase Type 4 (PDE4B)
Type:
Protein
Mol. Mass.:
83318.87
Organism:
Homo sapiens (Human)
Description:
Q07343
Residue:
736
  
Inhibitor
Name:
BDBM50202532
Synonyms:
9-cyclopentyl-5,6-dihydro-7-ethyl-3-(3-methoxyphenyl)-9Hpyrazolo[3,4-c]-1,2,4-triazolo[4,3-alpha]pyridine | CHEMBL218793
Type:
Small organic molecule
Emp. Form.:
C21H25N5O
Mol. Mass.:
363.4561
SMILES:
CCc1nn(C2CCCC2)c-2c1CCn1c-2nnc1-c1cccc(OC)c1
: