Target
Adenosine receptor A2a
Ligand
BDBM50202528
Substrate
Meas. Tech.
ChEMBL_423764 (CHEMBL909519)
IC50
4400±n/a nM
Citation
 Duplantier, AJBachert, ELCheng, JBCohan, VLJenkinson, THKraus, KGMcKechney, MWPillar, JDWatson, JW SAR of a series of 5,6-dihydro-(9H)-pyrazolo[3,4-c]-1,2,4-triazolo[4,3-alpha]pyridines as potent inhibitors of human eosinophil phosphodiesterase. J Med Chem 50:344-9 (2007)  
Target
Name:
Adenosine receptor A2a
Synonyms:
A2A adenosine receptor (hA2A) ADENOSINE A2 ADORA2 Adenosine A2A receptor (A2AAR)
Type:
G Protein-Coupled Receptor (GPCR)
Mol. Mass.:
44716.46
Organism:
Homo sapiens (Human)
Description:
P29274
Residue:
412
  
Inhibitor
Name:
BDBM50202528
Synonyms:
8-Cyclopentyl-6-ethyl-3-thiophen-2-yl-5,8-dihydro-4H-1,2,3a,7,8-pentaaza-as-indacene CHEMBL217899
Type:
Small organic molecule
Emp. Form.:
C18H21N5S
Mol. Mass.:
339.458
SMILES:
CCc1nn(C2CCCC2)c-2c1CCn1c(nnc-21)-c1cccs1
: