Target
P2Y purinoceptor 2
Ligand
BDBM50205414
Substrate
Meas. Tech.
ChEMBL_428323 (CHEMBL917101)
EC50
830±n/a nM
Citation
 Ivanov, AAKo, HCosyn, LMaddileti, SBesada, PFricks, ICostanzi, SHarden, TKCalenbergh, SVJacobson, KA Molecular modeling of the human P2Y2 receptor and design of a selective agonist, 2'-amino-2'-deoxy-2-thiouridine 5'-triphosphate. J Med Chem 50:1166-76 (2007)  
Target
Name:
P2Y purinoceptor 2
Synonyms:
ATP receptor P2RY2 P2U purinoceptor 1 P2Y purinoceptor 2 Purinergic receptor | Purinergic receptor P2Y2
Type:
PROTEIN
Mol. Mass.:
42299.21
Organism:
Homo sapiens (Human)
Description:
ChEMBL_1455361
Residue:
377
  
Inhibitor
Name:
BDBM50205414
Synonyms:
({[({[(2R,3S,4R,5R)-3,4-dihydroxy-5-(5-iodo-2,4-dioxo-1,2,3,4-tetrahydropyrimidin-1-yl)oxolan-2-yl]methoxy}(hydroxy)phosphoryl)oxy](hydroxy)phosphoryl}oxy)phosphonic acid | CHEMBL220398
Type:
Small organic molecule
Emp. Form.:
C9H14IN2O15P3
Mol. Mass.:
610.0376
SMILES:
O[C@H]1[C@@H](O)[C@@H](O[C@@H]1COP(O)(=O)OP(O)(=O)OP(O)(O)=O)n1cc(I)c(=O)[nH]c1=O
: