Target
Thymidylate kinase
Ligand
BDBM50156572
Substrate
Meas. Tech.
ChEMBL_429555 (CHEMBL919553)
Ki
1040000±n/a nM
Citation
 Vanheusden, VMunier-Lehmann, HFroeyen, MBusson, RRozenski, JHerdewijn, PVan Calenbergh, S Discovery of bicyclic thymidine analogues as selective and high-affinity inhibitors of Mycobacterium tuberculosis thymidine monophosphate kinase. J Med Chem 47:6187-94 (2004)  
Target
Name:
Thymidylate kinase
Synonyms:
CDC8 KTHY_HUMAN TYMK
Type:
PROTEIN
Mol. Mass.:
23824.09
Organism:
Homo sapiens (Human)
Description:
ChEMBL_946051
Residue:
212
  
Inhibitor
Name:
BDBM50156572
Synonyms:
1-[3-C-(azido-methyl)-2,3-dideoxy-beta-D-thereo-pentofuranosyl]thymine | CHEMBL222185
Type:
Small organic molecule
Emp. Form.:
C11H16N5O4
Mol. Mass.:
282.2753
SMILES:
Cc1cn([C@H]2C[C@H](CN[N+]#N)[C@@H](CO)O2)c(=O)[nH]c1=O
: