Target
Dehydrogenase/reductase SDR family member 9
Ligand
BDBM50371166
Substrate
Meas. Tech.
ChEMBL_447932 (CHEMBL898183)
IC50
129000±n/a nM
Citation
 Harrak, YRosell, GDaidone, GPlescia, SSchillaci, DPujol, MD Synthesis and biological activity of new anti-inflammatory compounds containing the 1,4-benzodioxine and/or pyrrole system. Bioorg Med Chem 15:4876-90 (2007)  
Target
Name:
Dehydrogenase/reductase SDR family member 9
Synonyms:
3-alpha hydroxysteroid dehydrogenase DHRS9_RAT Short-chain dehydrogenase/reductase retSDR8 | eRolDH
Type:
PROTEIN
Mol. Mass.:
35223.09
Organism:
Rattus norvegicus
Description:
ChEMBL_447932
Residue:
319
  
Inhibitor
Name:
BDBM50371166
Synonyms:
CHEMBL236444
Type:
Small organic molecule
Emp. Form.:
C13H14O4
Mol. Mass.:
234.2479
SMILES:
OC(=O)C1CCCc2cc3OCCOc3cc12
: