Target
Dehydrogenase/reductase SDR family member 9
Ligand
BDBM50371167
Substrate
Meas. Tech.
ChEMBL_447932 (CHEMBL898183)
IC50
70000±n/a nM
Citation
 Harrak, YRosell, GDaidone, GPlescia, SSchillaci, DPujol, MD Synthesis and biological activity of new anti-inflammatory compounds containing the 1,4-benzodioxine and/or pyrrole system. Bioorg Med Chem 15:4876-90 (2007)  
Target
Name:
Dehydrogenase/reductase SDR family member 9
Synonyms:
3-alpha hydroxysteroid dehydrogenase DHRS9_RAT Short-chain dehydrogenase/reductase retSDR8 | eRolDH
Type:
PROTEIN
Mol. Mass.:
35223.09
Organism:
Rattus norvegicus
Description:
ChEMBL_447932
Residue:
319
  
Inhibitor
Name:
BDBM50371167
Synonyms:
CHEMBL236030
Type:
Small organic molecule
Emp. Form.:
C14H11NO5
Mol. Mass.:
273.2408
SMILES:
OC(=O)C(=O)c1cccn1-c1ccc2OCCOc2c1
: