Target
Dehydrogenase/reductase SDR family member 9
Ligand
BDBM50371172
Substrate
Meas. Tech.
ChEMBL_447932 (CHEMBL898183)
IC50
>1000000±n/a nM
Citation
 Harrak, YRosell, GDaidone, GPlescia, SSchillaci, DPujol, MD Synthesis and biological activity of new anti-inflammatory compounds containing the 1,4-benzodioxine and/or pyrrole system. Bioorg Med Chem 15:4876-90 (2007)  
Target
Name:
Dehydrogenase/reductase SDR family member 9
Synonyms:
3-alpha hydroxysteroid dehydrogenase DHRS9_RAT Short-chain dehydrogenase/reductase retSDR8 | eRolDH
Type:
PROTEIN
Mol. Mass.:
35223.09
Organism:
Rattus norvegicus
Description:
ChEMBL_447932
Residue:
319
  
Inhibitor
Name:
BDBM50371172
Synonyms:
CHEMBL236434
Type:
Small organic molecule
Emp. Form.:
C11H12O4
Mol. Mass.:
208.2106
SMILES:
C[C@@H](C(O)=O)c1ccc2OCCOc2c1
: