Target
Polyunsaturated fatty acid lipoxygenase ALOX12
Ligand
BDBM50221402
Substrate
Meas. Tech.
ChEMBL_449592 (CHEMBL898687)
IC50
210±n/a nM
Citation
 Deschamps, JDGautschi, JTWhitman, SJohnson, TAGassner, NCCrews, PHolman, TR Discovery of platelet-type 12-human lipoxygenase selective inhibitors by high-throughput screening of structurally diverse libraries. Bioorg Med Chem 15:6900-8 (2007)  
Target
Name:
Polyunsaturated fatty acid lipoxygenase ALOX12
Synonyms:
12-LOX 12LO Arachidonate 12-lipoxygenase LOG12 Platelet 12-lipoxygenase | Platelet-type lipoxygenase 12
Type:
Protein
Mol. Mass.:
75689.18
Organism:
Homo sapiens (Human)
Description:
P18054
Residue:
663
  
Inhibitor
Name:
BDBM50221402
Synonyms:
CHEMBL238624 | NSC-172033
Type:
Small organic molecule
Emp. Form.:
C26H14Cl8O4
Mol. Mass.:
674.011
SMILES:
Oc1c(Cl)cc(cc1Cl)C(C(c1cc(Cl)c(O)c(Cl)c1)c1cc(Cl)c(O)c(Cl)c1)c1cc(Cl)c(O)c(Cl)c1
: