Target
Polyunsaturated fatty acid lipoxygenase ALOX12
Ligand
BDBM50214969
Substrate
Meas. Tech.
ChEMBL_449592 (CHEMBL898687)
IC50
580±n/a nM
Citation
 Deschamps, JDGautschi, JTWhitman, SJohnson, TAGassner, NCCrews, PHolman, TR Discovery of platelet-type 12-human lipoxygenase selective inhibitors by high-throughput screening of structurally diverse libraries. Bioorg Med Chem 15:6900-8 (2007)  
Target
Name:
Polyunsaturated fatty acid lipoxygenase ALOX12
Synonyms:
12-LOX 12LO Arachidonate 12-lipoxygenase LOG12 Platelet 12-lipoxygenase | Platelet-type lipoxygenase 12
Type:
Protein
Mol. Mass.:
75689.18
Organism:
Homo sapiens (Human)
Description:
P18054
Residue:
663
  
Inhibitor
Name:
BDBM50214969
Synonyms:
1,3,6-Trihydroxy-7-methoxy-2,8-bis-(3-methyl-but-2-enyl)-xanthen-9-one 1,3,6-trihydroxy-7-methoxy-2,8-diprenylxanthone Mangostin | alpha-mangostin
Type:
Small organic molecule
Emp. Form.:
C24H26O6
Mol. Mass.:
410.4596
SMILES:
[#6]-[#8]-c1c(-[#8])cc2oc3cc(-[#8])c(-[#6]\[#6]=[#6](\[#6])-[#6])c(-[#8])c3c(=O)c2c1-[#6]\[#6]=[#6](\[#6])-[#6]
: