Target
Adenosine receptor A2a
Ligand
BDBM50224346
Substrate
Meas. Tech.
ChEMBL_450736 (CHEMBL901019)
Ki
460.2±n/a nM
Citation
 Da Settimo, FPrimofiore, GTaliani, SMarini, AMLa Motta, CSimorini, FSalerno, SSergianni, VTuccinardi, TMartinelli, ACosimelli, BGreco, GNovellino, ECiampi, OTrincavelli, MLMartini, C 5-amino-2-phenyl[1,2,3]triazolo[1,2-a][1,2,4]benzotriazin-1-one: a versatile scaffold to obtain potent and selective A3 adenosine receptor antagonists. J Med Chem 50:5676-84 (2007)  
Target
Name:
Adenosine receptor A2a
Synonyms:
A2A adenosine receptor (hA2A) ADENOSINE A2 ADORA2 Adenosine A2A receptor (A2AAR)
Type:
G Protein-Coupled Receptor (GPCR)
Mol. Mass.:
44716.46
Organism:
Homo sapiens (Human)
Description:
P29274
Residue:
412
  
Inhibitor
Name:
BDBM50224346
Synonyms:
1-(1-oxo-2-phenyl-1H-3,3a,5,9b-tetraaza-cyclopenta[a]naphthalen-4-yl)-3-phenyl-urea | CHEMBL235718
Type:
Small organic molecule
Emp. Form.:
C22H16N6O2
Mol. Mass.:
396.4014
SMILES:
O=C(Nc1ccccc1)Nc1nc2ccccc2n2n1nc(-c1ccccc1)c2=O
: