Target
Adenosine receptor A1
Ligand
BDBM50224346
Substrate
Meas. Tech.
ChEMBL_450735 (CHEMBL901018)
Ki
91.1±n/a nM
Citation
 Da Settimo, FPrimofiore, GTaliani, SMarini, AMLa Motta, CSimorini, FSalerno, SSergianni, VTuccinardi, TMartinelli, ACosimelli, BGreco, GNovellino, ECiampi, OTrincavelli, MLMartini, C 5-amino-2-phenyl[1,2,3]triazolo[1,2-a][1,2,4]benzotriazin-1-one: a versatile scaffold to obtain potent and selective A3 adenosine receptor antagonists. J Med Chem 50:5676-84 (2007)  
Target
Name:
Adenosine receptor A1
Synonyms:
A1 adenosine receptor (hA1) AA1R_HUMAN ADORA1 Adenosine A1-receptor Adenosine receptor A1 (hA1) | Adenosine transporter (AdT)
Type:
G Protein-Coupled Receptor (GPCR)
Mol. Mass.:
36520.92
Organism:
Homo sapiens (Human)
Description:
P30542
Residue:
326
  
Inhibitor
Name:
BDBM50224346
Synonyms:
1-(1-oxo-2-phenyl-1H-3,3a,5,9b-tetraaza-cyclopenta[a]naphthalen-4-yl)-3-phenyl-urea | CHEMBL235718
Type:
Small organic molecule
Emp. Form.:
C22H16N6O2
Mol. Mass.:
396.4014
SMILES:
O=C(Nc1ccccc1)Nc1nc2ccccc2n2n1nc(-c1ccccc1)c2=O
: