Target
Prostaglandin E2 receptor EP2 subtype
Ligand
BDBM50213980
Substrate
Meas. Tech.
ChEMBL_456219 (CHEMBL888229)
Ki
125.5±n/a nM
Citation
 Xiao, YAraldi, GLZhao, ZBrugger, NKarra, SFischer, DPalmer, E Discovery of novel prostaglandin analogs of PGE2 as potent and selective EP2 and EP4 receptor agonists. Bioorg Med Chem Lett 17:4323-7 (2007)  
Target
Name:
Prostaglandin E2 receptor EP2 subtype
Synonyms:
PE2R2_HUMAN PTGER2 Prostaglandin E2 receptor Prostanoid EP2 Receptor
Type:
Enzyme
Mol. Mass.:
39775.71
Organism:
Homo sapiens (Human)
Description:
P43116
Residue:
358
  
Inhibitor
Name:
BDBM50213980
Synonyms:
4-(2-((R)-2-((S)-3-hydroxyhept-1-enyl)-5-oxopyrrolidin-1-yl)ethyl)benzoate CHEMBL251294
Type:
Small organic molecule
Emp. Form.:
C20H27NO4
Mol. Mass.:
345.4327
SMILES:
CCCC[C@H](O)\C=C\[C@H]1CCC(=O)N1CCc1ccc(cc1)C(O)=O
: