Target
Peroxisome proliferator-activated receptor alpha
Ligand
BDBM28661
Substrate
Meas. Tech.
ChEMBL_456457 (CHEMBL887278)
EC50
3900±n/a nM
Citation
 Pettersson, IEbdrup, SHavranek, MPihera, PKorínek, MMogensen, JPJeppesen, CBJohansson, ESauerberg, P Design of a partial PPARdelta agonist. Bioorg Med Chem Lett 17:4625-9 (2007)  
Target
Name:
Peroxisome proliferator-activated receptor alpha
Synonyms:
NR1C1 PPAR PPAR-alpha PPARA_HUMAN Peroxisome proliferator-activated receptor | Peroxisome proliferator-activated receptor alpha (PPAR alpha)
Type:
Enzyme
Mol. Mass.:
52222.08
Organism:
Homo sapiens (Human)
Description:
Q07869
Residue:
468
  
Inhibitor
Name:
BDBM28661
Synonyms:
2-{2-methyl-4-[({4-methyl-2-[4-(trifluoromethyl)phenyl]-1,3-thiazol-5-yl}methyl)sulfanyl]phenoxy}acetic acid GW 501516 GW1516 | GW501516
Type:
Small organic molecule
Emp. Form.:
C21H18F3NO3S2
Mol. Mass.:
453.498
SMILES:
Cc1nc(sc1CSc1ccc(OCC(O)=O)c(C)c1)-c1ccc(cc1)C(F)(F)F
: