Target
Sodium-dependent serotonin transporter
Ligand
BDBM50371281
Substrate
Meas. Tech.
ChEMBL_463177 (CHEMBL948191)
Ki
1±n/a nM
Citation
 Ly, KSLetavic, MAKeith, JMMiller, JMStocking, EMBarbier, AJBonaventure, PLord, BJiang, XBoggs, JDDvorak, LMiller, KLNepomuceno, DWilson, SJCarruthers, NI Synthesis and biological activity of piperazine and diazepane amides that are histamine H3 antagonists and serotonin reuptake inhibitors. Bioorg Med Chem Lett 18:39-43 (2008)  
Target
Name:
Sodium-dependent serotonin transporter
Synonyms:
5-HT Transporter 5HT transporter Anandamid membrane transporter, AMT Monoamine transporters; Norepinephrine & serotonin Slc6a4 Sodium-dependent serotonin transporter (SERT) | imipramine receptor
Type:
Multi-pass membrane protein
Mol. Mass.:
70168.43
Organism:
Rattus norvegicus (rat)
Description:
P31652
Residue:
630
  
Inhibitor
Name:
BDBM50371281
Synonyms:
CHEMBL267267
Type:
Small organic molecule
Emp. Form.:
C24H33N3O2S
Mol. Mass.:
427.603
SMILES:
CNCc1cc(ccc1Oc1ccc(SC)cc1)C(=O)N1CCCN(CC1)C(C)C
: