Target
Histamine H3 receptor
Ligand
BDBM50371315
Substrate
Meas. Tech.
ChEMBL_463175 (CHEMBL948189)
Ki
1±n/a nM
Citation
 Ly, KSLetavic, MAKeith, JMMiller, JMStocking, EMBarbier, AJBonaventure, PLord, BJiang, XBoggs, JDDvorak, LMiller, KLNepomuceno, DWilson, SJCarruthers, NI Synthesis and biological activity of piperazine and diazepane amides that are histamine H3 antagonists and serotonin reuptake inhibitors. Bioorg Med Chem Lett 18:39-43 (2008)  
Target
Name:
Histamine H3 receptor
Synonyms:
G-protein coupled receptor 97 HH3R HRH3 Histamine H3 receptor (H3) Histamine receptor (H3 and H4)
Type:
G Protein-Coupled Receptor (GPCR)
Mol. Mass.:
48691.47
Organism:
Homo sapiens (Human)
Description:
Binding assays were using CHO cells stably expressing hH3R receptors.
Residue:
445
  
Inhibitor
Name:
BDBM50371315
Synonyms:
CHEMBL273136
Type:
Small organic molecule
Emp. Form.:
C24H31N3O3
Mol. Mass.:
409.5212
SMILES:
CNCc1cc(ccc1Oc1cccc(OC)c1)C(=O)N1CCCN(CC1)C1CC1
: