Target
Disintegrin and metalloproteinase domain-containing protein 17
Ligand
BDBM50371340
Substrate
Meas. Tech.
ChEMBL_463233 (CHEMBL930623)
IC50
1±n/a nM
Citation
 Ott, GRAsakawa, NLu, ZLiu, RQCovington, MBVaddi, KQian, MNewton, RCChrist, DDTraskos, JMDecicco, CPDuan, JJ Alpha,beta-cyclic-beta-benzamido hydroxamic acids: novel templates for the design, synthesis, and evaluation of selective inhibitors of TNF-alpha converting enzyme (TACE). Bioorg Med Chem Lett 18:694-9 (2008)  
Target
Name:
Disintegrin and metalloproteinase domain-containing protein 17
Synonyms:
A disintegrin and metalloproteinase domain 17 ADAM 17 Snake venom-like protease TNF-alpha-Converting Enzyme
Type:
Metalloprotease
Mol. Mass.:
12197.99
Organism:
Sus scrofa (pig)
Description:
Partially purified TACE was obtained from porcine spleen.
Residue:
112
  
Inhibitor
Name:
BDBM50371340
Synonyms:
CHEMBL271234
Type:
Small organic molecule
Emp. Form.:
C27H30N4O4
Mol. Mass.:
474.5515
SMILES:
Cc1cc(COc2ccc(cc2)C(=O)N[C@@H]2CN(C[C@@H]2C(=O)NO)C2CCC2)c2ccccc2n1
: