Target
Interstitial collagenase
Ligand
BDBM50371340
Substrate
Meas. Tech.
ChEMBL_463235 (CHEMBL930624)
Ki
>4948±n/a nM
Citation
 Ott, GRAsakawa, NLu, ZLiu, RQCovington, MBVaddi, KQian, MNewton, RCChrist, DDTraskos, JMDecicco, CPDuan, JJ Alpha,beta-cyclic-beta-benzamido hydroxamic acids: novel templates for the design, synthesis, and evaluation of selective inhibitors of TNF-alpha converting enzyme (TACE). Bioorg Med Chem Lett 18:694-9 (2008)  
Target
Name:
Interstitial collagenase
Synonyms:
CLG MMP1 Matrix metalloproteinase-1 | Matrix metalloproteinase-1 (MMP-1)
Type:
Enzyme
Mol. Mass.:
54010.26
Organism:
Homo sapiens (Human)
Description:
P03956
Residue:
469
  
Inhibitor
Name:
BDBM50371340
Synonyms:
CHEMBL271234
Type:
Small organic molecule
Emp. Form.:
C27H30N4O4
Mol. Mass.:
474.5515
SMILES:
Cc1cc(COc2ccc(cc2)C(=O)N[C@@H]2CN(C[C@@H]2C(=O)NO)C2CCC2)c2ccccc2n1
: