Target
Intermediate conductance calcium-activated potassium channel protein 4
Ligand
BDBM50371382
Substrate
Meas. Tech.
ChEMBL_463302 (CHEMBL948111)
IC50
15±n/a nM
Citation
 McNaughton-Smith, GABurns, JFStocker, JWRigdon, GCCreech, CArrington, SShelton, Tde Franceschi, L Novel inhibitors of the Gardos channel for the treatment of sickle cell disease. J Med Chem 51:976-82 (2008)  
Target
Name:
Intermediate conductance calcium-activated potassium channel protein 4
Synonyms:
IK1 KCA4 KCNN4_HUMAN SK4
Type:
PROTEIN
Mol. Mass.:
47723.22
Organism:
Homo sapiens (Human)
Description:
ChEMBL_1361891
Residue:
427
  
Inhibitor
Name:
BDBM50371382
Synonyms:
CHEMBL408700
Type:
Small organic molecule
Emp. Form.:
C20H14F3NO
Mol. Mass.:
341.3265
SMILES:
NC(=O)C(c1ccc(F)cc1)(c1cccc(F)c1)c1cccc(F)c1
: