Target
Apoptosis regulator Bcl-2
Ligand
BDBM50372180
Substrate
Meas. Tech.
ChEMBL_464766 (CHEMBL930132)
Ki
4300±n/a nM
Citation
 Wang, LKong, FKokoski, CLAndrews, DWXing, C Development of dimeric modulators for anti-apoptotic Bcl-2 proteins. Bioorg Med Chem Lett 18:236-40 (2008)  
Target
Name:
Apoptosis regulator Bcl-2
Synonyms:
Apoptosis regulator Bcl-2 Protein BCL-2 BCL2_HUMAN | Bcl-2 Protein
Type:
Homodimer or heterodimer
Mol. Mass.:
26269.11
Organism:
Homo sapiens (Human)
Description:
P10415
Residue:
239
  
Inhibitor
Name:
BDBM50372180
Synonyms:
CHEMBL270646
Type:
Small organic molecule
Emp. Form.:
C42H36N2O9S4
Mol. Mass.:
841.003
SMILES:
OC(=O)[C@H](Cc1ccccc1)N1C(=S)S\C(=C/c2ccc(OCCOCCOc3ccc(\C=C4/SC(=S)N([C@@H](Cc5ccccc5)C(O)=O)C4=O)cc3)cc2)C1=O
: