Target
Isoprenyl transferase
Ligand
BDBM50372758
Substrate
Meas. Tech.
ChEMBL_465860 (CHEMBL951083)
IC50
300±n/a nM
Citation
 Peukert, SSun, YZhang, RHurley, BSabio, MShen, XGray, CDzink-Fox, JTao, JCebula, RWattanasin, S Design and structure-activity relationships of potent and selective inhibitors of undecaprenyl pyrophosphate synthase (UPPS): tetramic, tetronic acids and dihydropyridin-2-ones. Bioorg Med Chem Lett 18:1840-4 (2008)  
Target
Name:
Isoprenyl transferase
Synonyms:
Di-trans,poly-cis-decaprenylcistransferase ISPT_STRPN UPP synthase Undecaprenyl pyrophosphate synthase | uppS
Type:
PROTEIN
Mol. Mass.:
28705.02
Organism:
Streptococcus pneumoniae
Description:
ChEMBL_465860
Residue:
252
  
Inhibitor
Name:
BDBM50372758
Synonyms:
CHEMBL269960
Type:
Small organic molecule
Emp. Form.:
C24H26N2O3
Mol. Mass.:
390.4748
SMILES:
O=C(Nc1ccc(cc1)C1CCCCC1)C1C(=O)CN(Cc2ccccc2)C1=O
: