Target
Endo-beta-N-acetylglucosaminidase
Ligand
BDBM50373152
Substrate
Meas. Tech.
ChEMBL_467015 (CHEMBL924919)
IC50
38000±n/a nM
Citation
 Li, BTakegawa, KSuzuki, TYamamoto, KWang, LX Synthesis and inhibitory activity of oligosaccharide thiazolines as a class of mechanism-based inhibitors for endo-beta-N-acetylglucosaminidases. Bioorg Med Chem 16:4670-5 (2008)  
Target
Name:
Endo-beta-N-acetylglucosaminidase
Synonyms:
Type:
PROTEIN
Mol. Mass.:
72045.14
Organism:
Arthrobacter protophormiae
Description:
ChEMBL_467015
Residue:
645
  
Inhibitor
Name:
BDBM50373152
Synonyms:
CHEMBL260584
Type:
Small organic molecule
Emp. Form.:
C14H23NO9S
Mol. Mass.:
381.399
SMILES:
CC1=N[C@H]2[C@@H](O[C@H](CO)[C@@H](O[C@@H]3O[C@H](CO)[C@@H](O)[C@H](O)[C@@H]3O)[C@@H]2O)S1
: