Target
Glutamate receptor 1
Ligand
BDBM17657
Substrate
Meas. Tech.
ChEMBL_467201 (CHEMBL922514)
EC50
35000±n/a nM
Citation
 Pinto, AConti, PDe Amici, MTamborini, LMadsen, UNielsen, BChristesen, TBräuner-Osborne, HDe Micheli, C Synthesis and pharmacological characterization at glutamate receptors of the four enantiopure isomers of tricholomic acid. J Med Chem 51:2311-5 (2008)  
Target
Name:
Glutamate receptor 1
Synonyms:
AMPA-selective glutamate receptor 1 GluA1 GluR-A Glur1 Gria1
Type:
Protein
Mol. Mass.:
101583.91
Organism:
Rattus norvegicus (Rat)
Description:
P19490
Residue:
907
  
Inhibitor
Name:
BDBM17657
Synonyms:
(2S)-2-aminopentanedioic acid D-Glutamate L-Glu L-Glutamic acid L-gluatmate
Type:
Amino Acid
Emp. Form.:
C5H9NO4
Mol. Mass.:
147.1293
SMILES:
N[C@@H](CCC(O)=O)C(O)=O
: