Target
Transketolase
Ligand
BDBM50373874
Substrate
Meas. Tech.
ChEMBL_468615 (CHEMBL947912)
EC50
17000±n/a nM
Citation
 Thomas, AADe Meese, JLe Huerou, YBoyd, SARomoff, TTGonzales, SSGunawardana, IKaplan, TSullivan, FCondroski, KLyssikatos, JPAicher, TDBallard, JBernat, BDeWolf, WHan, MLemieux, CSmith, DWeiler, SWright, SKVigers, GBrandhuber, B Non-charged thiamine analogs as inhibitors of enzyme transketolase. Bioorg Med Chem Lett 18:509-12 (2008)  
Target
Name:
Transketolase
Synonyms:
TK TKT_HUMAN
Type:
PROTEIN
Mol. Mass.:
67886.43
Organism:
Homo sapiens (Human)
Description:
ChEMBL_468615
Residue:
623
  
Inhibitor
Name:
BDBM50373874
Synonyms:
CHEMBL257085
Type:
Small organic molecule
Emp. Form.:
C12H17N5O
Mol. Mass.:
247.2963
SMILES:
Cc1c(CCO)n[nH]c1Cc1cnc(C)nc1N
: