Target
Transketolase
Ligand
BDBM50373875
Substrate
Meas. Tech.
ChEMBL_468617 (CHEMBL947914)
Kd
63±n/a nM
Citation
 Thomas, AADe Meese, JLe Huerou, YBoyd, SARomoff, TTGonzales, SSGunawardana, IKaplan, TSullivan, FCondroski, KLyssikatos, JPAicher, TDBallard, JBernat, BDeWolf, WHan, MLemieux, CSmith, DWeiler, SWright, SKVigers, GBrandhuber, B Non-charged thiamine analogs as inhibitors of enzyme transketolase. Bioorg Med Chem Lett 18:509-12 (2008)  
Target
Name:
Transketolase
Synonyms:
TK TKT_HUMAN
Type:
PROTEIN
Mol. Mass.:
67886.43
Organism:
Homo sapiens (Human)
Description:
ChEMBL_468615
Residue:
623
  
Inhibitor
Name:
BDBM50373875
Synonyms:
CHEMBL401572
Type:
Small organic molecule
Emp. Form.:
C13H14F3N3OS
Mol. Mass.:
317.33
SMILES:
Cc1c(Cc2cnc(nc2N)C(F)(F)F)csc1CCO
: