Target
Transketolase
Ligand
BDBM50373879
Substrate
Meas. Tech.
ChEMBL_468614 (CHEMBL947911)
Kd
170±n/a nM
Citation
 Thomas, AADe Meese, JLe Huerou, YBoyd, SARomoff, TTGonzales, SSGunawardana, IKaplan, TSullivan, FCondroski, KLyssikatos, JPAicher, TDBallard, JBernat, BDeWolf, WHan, MLemieux, CSmith, DWeiler, SWright, SKVigers, GBrandhuber, B Non-charged thiamine analogs as inhibitors of enzyme transketolase. Bioorg Med Chem Lett 18:509-12 (2008)  
Target
Name:
Transketolase
Synonyms:
TK TKT_HUMAN
Type:
PROTEIN
Mol. Mass.:
67886.43
Organism:
Homo sapiens (Human)
Description:
ChEMBL_468615
Residue:
623
  
Inhibitor
Name:
BDBM50373879
Synonyms:
CHEMBL430409
Type:
Small organic molecule
Emp. Form.:
C13H21N4O6P2S
Mol. Mass.:
423.341
SMILES:
Cc1c(CCOP(C)(=O)OP(O)(O)=O)sc[n+]1Cc1cnc(C)nc1N
: