Target
Transketolase
Ligand
BDBM50373885
Substrate
Meas. Tech.
ChEMBL_468617 (CHEMBL947914)
Kd
64±n/a nM
Citation
 Thomas, AADe Meese, JLe Huerou, YBoyd, SARomoff, TTGonzales, SSGunawardana, IKaplan, TSullivan, FCondroski, KLyssikatos, JPAicher, TDBallard, JBernat, BDeWolf, WHan, MLemieux, CSmith, DWeiler, SWright, SKVigers, GBrandhuber, B Non-charged thiamine analogs as inhibitors of enzyme transketolase. Bioorg Med Chem Lett 18:509-12 (2008)  
Target
Name:
Transketolase
Synonyms:
TK TKT_HUMAN
Type:
PROTEIN
Mol. Mass.:
67886.43
Organism:
Homo sapiens (Human)
Description:
ChEMBL_468615
Residue:
623
  
Inhibitor
Name:
BDBM50373885
Synonyms:
CHEMBL255550
Type:
Small organic molecule
Emp. Form.:
C15H21N3OS
Mol. Mass.:
291.412
SMILES:
CC(C)c1ncc(Cc2csc(CCO)c2C)c(N)n1
: