Target
Gamma-aminobutyric acid receptor subunit alpha-1
Ligand
BDBM86522
Substrate
Meas. Tech.
ChEMBL_471765 (CHEMBL921137)
Ki
0.45±n/a nM
Citation
 Hoepping, ADiekers, MDeuther-Conrad, WScheunemann, MFischer, SHiller, AWegner, FSteinbach, JBrust, P Synthesis of fluorine substituted pyrazolopyrimidines as potential leads for the development of PET-imaging agents for the GABAA receptors. Bioorg Med Chem 16:1184-94 (2008)  
Target
Name:
Gamma-aminobutyric acid receptor subunit alpha-1
Synonyms:
Benzodiazepine central GABA A Benzodiazepine GABA A Benzodiazepine Type II GABA A Benzodiazepine Type IIM GABA A Benzodiazepine omega2 GABA A alpha1 GABA receptor alpha-1 subunit GABA-PICROTOXIN Gabra-1 TBPS
Type:
Enzyme
Mol. Mass.:
51770.21
Organism:
Rattus norvegicus (Rat)
Description:
P62813
Residue:
455
  
Inhibitor
Name:
BDBM86522
Synonyms:
CAS_325715-02-4 | Indiplon
Type:
Small organic molecule
Emp. Form.:
C20H16N4O2S
Mol. Mass.:
376.432
SMILES:
CN(C(C)=O)c1cccc(c1)-c1ccnc2c(cnn12)C(=O)c1cccs1
: