Target
Thymidine kinase
Ligand
BDBM1
Substrate
Meas. Tech.
ChEMBL_474153 (CHEMBL938411)
IC50
4100±n/a nM
Citation
 Focher, FLossani, AVerri, ASpadari, SMaioli, AGambino, JJWright, GEEberle, RBlack, DHMedveczky, PMedveczky, MShugar, D Sensitivity of monkey B virus (Cercopithecine herpesvirus 1) to antiviral drugs: role of thymidine kinase in antiviral activities of substrate analogs and acyclonucleosides. Antimicrob Agents Chemother 51:2028-34 (2007)  
Target
Name:
Thymidine kinase
Synonyms:
Type:
PROTEIN
Mol. Mass.:
40204.56
Organism:
Macacine herpesvirus 1
Description:
ChEMBL_474153
Residue:
370
  
Inhibitor
Name:
BDBM1
Synonyms:
dT | thymidine
Type:
Nucleoside or nucleotide
Emp. Form.:
C10H14N2O5
Mol. Mass.:
242.2286
SMILES:
Cc1cn([C@H]2C[C@H](O)[C@@H](CO)O2)c(=O)[nH]c1=O
: