Target
Alpha-1B adrenergic receptor
Ligand
BDBM50377401
Substrate
Meas. Tech.
ChEMBL_479651 (CHEMBL922399)
EC50
>10000±n/a nM
Citation
 Whitlock, GAConlon, KMcMurray, GRoberts, LRStobie, AThurlow, RJ Novel 2-imidazoles as potent and selective alpha1A adrenoceptor partial agonists. Bioorg Med Chem Lett 18:2930-4 (2008)  
Target
Name:
Alpha-1B adrenergic receptor
Synonyms:
ADA1B_HUMAN Adrenergic alpha1B Adrenergic receptor alpha Alpha 1B-adrenoreceptor | Alpha-1B adrenergic receptor
Type:
Enzyme
Mol. Mass.:
56862.13
Organism:
Homo sapiens (Human)
Description:
P35368
Residue:
520
  
Inhibitor
Name:
BDBM50377401
Synonyms:
CHEMBL407308
Type:
Small organic molecule
Emp. Form.:
C15H13N3O
Mol. Mass.:
251.2832
SMILES:
C1Cc2c(cccc2-c2ncco2)C1c1ncc[nH]1
: