Target
Melanocortin receptor 3
Ligand
BDBM50377916
Substrate
Meas. Tech.
ChEMBL_532753 (CHEMBL972327)
IC50
380±n/a nM
Citation
 Grieco, PCai, MLiu, LMayorov, AChandler, KTrivedi, DLin, GCampiglia, PNovellino, EHruby, VJ Design and microwave-assisted synthesis of novel macrocyclic peptides active at melanocortin receptors: discovery of potent and selective hMC5R receptor antagonists. J Med Chem 51:2701-7 (2008)  
Target
Name:
Melanocortin receptor 3
Synonyms:
MC3-R MC3R_HUMAN Melanocortin receptor (M3 and M4)
Type:
Enzyme
Mol. Mass.:
36044.86
Organism:
Homo sapiens (Human)
Description:
P41968
Residue:
323
  
Inhibitor
Name:
BDBM50377916
Synonyms:
CHEMBL552520 | CHEMBL553202
Type:
Small organic molecule
Emp. Form.:
C41H47N11O8S
Mol. Mass.:
853.946
SMILES:
N\C([NH-])=[NH+]/CCCC1NC(=O)C(Cc2ccccc2)NC(=O)C2CCCN2C(=O)c2cc(ccc2SCC(NC(=O)C(Cc2c[nH]c3ccccc23)NC1=O)C(N)=O)[N+]([O-])=O
: