Target
Melanocortin receptor 3
Ligand
BDBM50261679
Substrate
Meas. Tech.
ChEMBL_532753 (CHEMBL972327)
IC50
>1000±n/a nM
Citation
 Grieco, PCai, MLiu, LMayorov, AChandler, KTrivedi, DLin, GCampiglia, PNovellino, EHruby, VJ Design and microwave-assisted synthesis of novel macrocyclic peptides active at melanocortin receptors: discovery of potent and selective hMC5R receptor antagonists. J Med Chem 51:2701-7 (2008)  
Target
Name:
Melanocortin receptor 3
Synonyms:
MC3-R MC3R_HUMAN Melanocortin receptor (M3 and M4)
Type:
Enzyme
Mol. Mass.:
36044.86
Organism:
Homo sapiens (Human)
Description:
P41968
Residue:
323
  
Inhibitor
Name:
BDBM50261679
Synonyms:
(3R,6S,9S,12R,15S)-9-(4-aminobutyl)-12-benzyl-15-(1H-imidazol-5-ylmethyl)-6-(1H-indol-3-ylmethyl)-19-nitro-5,8,11,14,17-pentaoxo-2,3,4,5,6,7,8,9,10,11,12,13,14,15,16,17-hexadecahydro-1,4,7,10,13,16-benzothiapentazacyclononadecine-3-carboxamide | CHEMBL501158
Type:
Small organic molecule
Emp. Form.:
C42H47N11O8S
Mol. Mass.:
865.956
SMILES:
NCCCC[C@@H]1NC(=O)[C@@H](Cc2ccccc2)NC(=O)[C@H](Cc2cnc[nH]2)NC(=O)c2cc(ccc2SC[C@H](NC(=O)[C@H](Cc2c[nH]c3ccccc23)NC1=O)C(N)=O)[N+]([O-])=O
: