Target
Melanocortin receptor 4
Ligand
BDBM50261684
Substrate
Meas. Tech.
ChEMBL_532760 (CHEMBL972334)
IC50
>1000±n/a nM
Citation
 Grieco, PCai, MLiu, LMayorov, AChandler, KTrivedi, DLin, GCampiglia, PNovellino, EHruby, VJ Design and microwave-assisted synthesis of novel macrocyclic peptides active at melanocortin receptors: discovery of potent and selective hMC5R receptor antagonists. J Med Chem 51:2701-7 (2008)  
Target
Name:
Melanocortin receptor 4
Synonyms:
MC4-R MC4R_HUMAN Melanocortin receptor 4 (MC-4) Melanocortin receptor 4 (MC4R)
Type:
Enzyme
Mol. Mass.:
36949.50
Organism:
Homo sapiens (Human)
Description:
P32245
Residue:
332
  
Inhibitor
Name:
BDBM50261684
Synonyms:
(3R,6R,9S,12R,15S)-12-benzyl-9-(3-carbamimidamidopropyl)-15-(1H-imidazol-5-ylmethyl)-6-(1H-indol-3-ylmethyl)-19-nitro-5,8,11,14,17-pentaoxo-2,3,4,5,6,7,8,9,10,11,12,13,14,15,16,17-hexadecahydro-1,4,7,10,13,16-benzothiapentazacyclononadecine-3-carboxamide | CHEMBL508068
Type:
Small organic molecule
Emp. Form.:
C42H47N13O8S
Mol. Mass.:
893.97
SMILES:
NC([NH-])=[NH+]CCC[C@@H]1NC(=O)[C@@H](Cc2ccccc2)NC(=O)[C@H](Cc2cnc[nH]2)NC(=O)c2cc(ccc2SC[C@H](NC(=O)[C@@H](Cc2c[nH]c3ccccc23)NC1=O)C(N)=O)[N+]([O-])=O
: