Target
Melanocyte-stimulating hormone receptor
Ligand
BDBM50377916
Substrate
Meas. Tech.
ChEMBL_532748 (CHEMBL972322)
IC50
>1500±n/a nM
Citation
 Grieco, PCai, MLiu, LMayorov, AChandler, KTrivedi, DLin, GCampiglia, PNovellino, EHruby, VJ Design and microwave-assisted synthesis of novel macrocyclic peptides active at melanocortin receptors: discovery of potent and selective hMC5R receptor antagonists. J Med Chem 51:2701-7 (2008)  
Target
Name:
Melanocyte-stimulating hormone receptor
Synonyms:
MC1-R MSH-R MSHR_HUMAN Melanocortin receptor (M1 and M4) Melanocortin receptor 1 (MC1-R) | Melanocortin receptor 1 (MC1R)
Type:
Enzyme
Mol. Mass.:
34717.23
Organism:
Homo sapiens (Human)
Description:
Q01726
Residue:
317
  
Inhibitor
Name:
BDBM50377916
Synonyms:
CHEMBL552520 | CHEMBL553202
Type:
Small organic molecule
Emp. Form.:
C41H47N11O8S
Mol. Mass.:
853.946
SMILES:
N\C([NH-])=[NH+]/CCCC1NC(=O)C(Cc2ccccc2)NC(=O)C2CCCN2C(=O)c2cc(ccc2SCC(NC(=O)C(Cc2c[nH]c3ccccc23)NC1=O)C(N)=O)[N+]([O-])=O
: