Target
Melanocyte-stimulating hormone receptor
Ligand
BDBM50261673
Substrate
Meas. Tech.
ChEMBL_532748 (CHEMBL972322)
IC50
>2000±n/a nM
Citation
 Grieco, PCai, MLiu, LMayorov, AChandler, KTrivedi, DLin, GCampiglia, PNovellino, EHruby, VJ Design and microwave-assisted synthesis of novel macrocyclic peptides active at melanocortin receptors: discovery of potent and selective hMC5R receptor antagonists. J Med Chem 51:2701-7 (2008)  
Target
Name:
Melanocyte-stimulating hormone receptor
Synonyms:
MC1-R MSH-R MSHR_HUMAN Melanocortin receptor (M1 and M4) Melanocortin receptor 1 (MC1-R) | Melanocortin receptor 1 (MC1R)
Type:
Enzyme
Mol. Mass.:
34717.23
Organism:
Homo sapiens (Human)
Description:
Q01726
Residue:
317
  
Inhibitor
Name:
BDBM50261673
Synonyms:
(3R,6S,9S,12R,15S)-12-benzyl-9-(3-carbamimidamidopropyl)-15-(cyclohexylmethyl)-6-(1H-indol-3-ylmethyl)-19-nitro-5,8,11,14,17-pentaoxo-2,3,4,5,6,7,8,9,10,11,12,13,14,15,16,17-hexadecahydro-1,4,7,10,13,16-benzothiapentazacyclononadecine-3-carboxamide | CHEMBL510234
Type:
Small organic molecule
Emp. Form.:
C45H55N11O8S
Mol. Mass.:
910.052
SMILES:
N\C([NH-])=[NH+]/CCCC1NC(=O)C(Cc2ccccc2)NC(=O)C(CC2CCCCC2)NC(=O)c2cc(ccc2SCC(NC(=O)C(Cc2c[nH]c3ccccc23)NC1=O)C(N)=O)[N+]([O-])=O
: