Target
Melanocortin receptor 5
Ligand
BDBM50261677
Substrate
Meas. Tech.
ChEMBL_532763 (CHEMBL975196)
IC50
130±n/a nM
Citation
 Grieco, PCai, MLiu, LMayorov, AChandler, KTrivedi, DLin, GCampiglia, PNovellino, EHruby, VJ Design and microwave-assisted synthesis of novel macrocyclic peptides active at melanocortin receptors: discovery of potent and selective hMC5R receptor antagonists. J Med Chem 51:2701-7 (2008)  
Target
Name:
Melanocortin receptor 5
Synonyms:
MC-2 MC5R Melanocortin MC5 Melanocortin receptor 5 | Melanocortin receptor 5 (MC5R)
Type:
Enzyme
Mol. Mass.:
36612.92
Organism:
Homo sapiens (Human)
Description:
P33032
Residue:
325
  
Inhibitor
Name:
BDBM50261677
Synonyms:
(3R,6S,9S,12S,15S)-9-(3-carbamimidamidopropyl)-15-(1H-imidazol-5-ylmethyl)-6-(1H-indol-3-ylmethyl)-12-(naphthalen-2-ylmethyl)-19-nitro-5,8,11,14,17-pentaoxo-2,3,4,5,6,7,8,9,10,11,12,13,14,15,16,17-hexadecahydro-1,4,7,10,13,16-benzothiapentazacyclononadecine-3-carboxamide | CHEMBL508816
Type:
Small organic molecule
Emp. Form.:
C46H49N13O8S
Mol. Mass.:
944.029
SMILES:
NC([NH-])=[NH+]CCC[C@@H]1NC(=O)[C@H](Cc2ccc3ccccc3c2)NC(=O)[C@H](Cc2cnc[nH]2)NC(=O)c2cc(ccc2SC[C@H](NC(=O)[C@H](Cc2c[nH]c3ccccc23)NC1=O)C(N)=O)[N+]([O-])=O
: