Target
Melanocortin receptor 5
Ligand
BDBM50261671
Substrate
Meas. Tech.
ChEMBL_532763 (CHEMBL975196)
IC50
560±n/a nM
Citation
 Grieco, PCai, MLiu, LMayorov, AChandler, KTrivedi, DLin, GCampiglia, PNovellino, EHruby, VJ Design and microwave-assisted synthesis of novel macrocyclic peptides active at melanocortin receptors: discovery of potent and selective hMC5R receptor antagonists. J Med Chem 51:2701-7 (2008)  
Target
Name:
Melanocortin receptor 5
Synonyms:
MC-2 MC5R Melanocortin MC5 Melanocortin receptor 5 | Melanocortin receptor 5 (MC5R)
Type:
Enzyme
Mol. Mass.:
36612.92
Organism:
Homo sapiens (Human)
Description:
P33032
Residue:
325
  
Inhibitor
Name:
BDBM50261671
Synonyms:
(3R,6S,9S,12R)-12-benzyl-9-(3-carbamimidamidopropyl)-6-(1H-indol-3-ylmethyl)-19-nitro-5,8,11,14,17-pentaoxo-1',3',3,4,5,6,7,8,9,10,11,12,13,14,16,17-hexadecahydro-2H-spiro[1,4,7,10,13,16-benzothiapentazacyclononadecine-15,2'-indene]-3-carboxamide | CHEMBL449124
Type:
Small organic molecule
Emp. Form.:
C46H49N11O8S
Mol. Mass.:
916.015
SMILES:
N\C([NH-])=[NH+]/CCCC1NC(=O)C(Cc2ccccc2)NC(=O)C2(Cc3ccccc3C2)NC(=O)c2cc(ccc2SCC(NC(=O)C(Cc2c[nH]c3ccccc23)NC1=O)C(N)=O)[N+]([O-])=O
: