Target
P2Y purinoceptor 4
Ligand
BDBM50118213
Substrate
Meas. Tech.
ChEMBL_552863 (CHEMBL958068)
EC50
90±n/a nM
Citation
 Ko, HCarter, RLCosyn, LPetrelli, Rde Castro, SBesada, PZhou, YCappellacci, LFranchetti, PGrifantini, MVan Calenbergh, SHarden, TKJacobson, KA Synthesis and potency of novel uracil nucleotides and derivatives as P2Y2 and P2Y6 receptor agonists. Bioorg Med Chem 16:6319-32 (2008)  
Target
Name:
P2Y purinoceptor 4
Synonyms:
NRU P2RY4 P2Y purinoceptor 4 Pyrimidinergic receptor P2Y4 Uridine nucleotide receptor
Type:
PROTEIN
Mol. Mass.:
40977.17
Organism:
Homo sapiens (Human)
Description:
ChEMBL_751027
Residue:
365
  
Inhibitor
Name:
BDBM50118213
Synonyms:
5'-UTP H4utp uridine 5'-(tetrahydrogen triphosphate) | uridine 5'-triphosphoric acid
Type:
Small organic molecule
Emp. Form.:
C9H15N2O15P3
Mol. Mass.:
484.1411
SMILES:
O[C@@H]1[C@@H](COP(O)(=O)OP(O)(=O)OP(O)(O)=O)O[C@H]([C@@H]1O)n1ccc(=O)[nH]c1=O
: