Target
M-phase inducer phosphatase 2
Ligand
BDBM50267086
Substrate
Meas. Tech.
ChEMBL_535787 (CHEMBL991552)
IC50
70±n/a nM
Citation
 Braud, EGoddard, MLKolb, SBrun, MPMondésert, OQuaranta, MGresh, NDucommun, BGarbay, C Novel naphthoquinone and quinolinedione inhibitors of CDC25 phosphatase activity with antiproliferative properties. Bioorg Med Chem 16:9040-9 (2008)  
Target
Name:
M-phase inducer phosphatase 2
Synonyms:
CDC25B Dual specificity phosphatase (CDC25B) M-phase inducer phosphatase 2 (CDC25B) | MPIP2_HUMAN
Type:
Protein
Mol. Mass.:
64985.27
Organism:
Homo sapiens (Human)
Description:
Residue:
580
  
Inhibitor
Name:
BDBM50267086
Synonyms:
Adociaquinone B | CHEMBL476648
Type:
Small organic molecule
Emp. Form.:
C22H17NO6S
Mol. Mass.:
423.438
SMILES:
C[C@@]12CCCc3coc(c13)C(=O)c1cc3C(=O)C4=NCCS(=O)(=O)C4C(=O)c3cc21
: