Target
Neuronal acetylcholine receptor subunit alpha-3
Ligand
BDBM50275262
Substrate
Meas. Tech.
ChEMBL_494697 (CHEMBL938656)
Ki
420±n/a nM
Citation
 Hansen, CPJensen, AAChristensen, JKBalle, TLiljefors, TFrølund, B Novel acetylcholine and carbamoylcholine analogues: development of a functionally selective alpha4beta2 nicotinic acetylcholine receptor agonist. J Med Chem 51:7380-95 (2009)  
Target
Name:
Neuronal acetylcholine receptor subunit alpha-3
Synonyms:
ACHA3_RAT Chrna3
Type:
Enzyme
Mol. Mass.:
56995.52
Organism:
Rattus norvegicus (Rat)
Description:
P04757
Residue:
499
  
Inhibitor
Name:
BDBM50275262
Synonyms:
3-(dimethylamino)butyl dimethylcarbamate CHEMBL486572
Type:
Small organic molecule
Emp. Form.:
C9H20N2O2
Mol. Mass.:
188.2673
SMILES:
CC(CCOC(=O)N(C)C)N(C)C
: