Target
Histamine H4 receptor
Ligand
BDBM50276073
Substrate
Meas. Tech.
ChEMBL_493068 (CHEMBL937683)
EC50
6.3±n/a nM
Citation
 Ghorai, PKraus, AKeller, MGötte, CIgel, PSchneider, ESchnell, DBernhardt, GDove, SZabel, MElz, SSeifert, RBuschauer, A Acylguanidines as bioisosteres of guanidines: NG-acylated imidazolylpropylguanidines, a new class of histamine H2 receptor agonists. J Med Chem 51:7193-204 (2009)  
Target
Name:
Histamine H4 receptor
Synonyms:
AXOR35 GPCR105 HH4R HRH4 Histamine H4 receptor Histamine receptor (H3 and H4) SP9144
Type:
G Protein-Coupled Receptor (GPCR)
Mol. Mass.:
44517.02
Organism:
Homo sapiens (Human)
Description:
Binding assays were using CHO cells stably expressing hH4R receptors.
Residue:
390
  
Inhibitor
Name:
BDBM50276073
Synonyms:
CHEMBL502339 | N1-[3-(1H-Imidazol-4-yl)propyl]-N2-[3-(thiophen-2-yl)butanoyl] guanidine
Type:
Small organic molecule
Emp. Form.:
C15H21N5OS
Mol. Mass.:
319.425
SMILES:
CC(CC(=O)NC(N)=NCCCc1cnc[nH]1)c1cccs1
: