Target
Aromatase
Ligand
BDBM50307919
Substrate
Meas. Tech.
ChEMBL_612867 (CHEMBL1067556)
IC50
0.22±n/a nM
Citation
 Woo, LWJackson, TPutey, ACozier, GLeonard, PAcharya, KRChander, SKPurohit, AReed, MJPotter, BV Highly potent first examples of dual aromatase-steroid sulfatase inhibitors based on a biphenyl template. J Med Chem 53:2155-70 (2010)  
Target
Name:
Aromatase
Synonyms:
ARO1 CP19A_HUMAN CYP19 CYPXIX Cytochrome P450 19A1 Cytochrome P450-C19 (CYP19) FL cytokine receptor precursor | P-450AROM
Type:
Enzyme
Mol. Mass.:
57888.92
Organism:
Homo sapiens (Human)
Description:
P11511
Residue:
503
  
Inhibitor
Name:
BDBM50307919
Synonyms:
5-((1H-1,2,4-triazol-1-yl)methyl)-3'-chlorobiphenyl-2-carbonitrile | CHEMBL589974
Type:
Small organic molecule
Emp. Form.:
C16H11ClN4
Mol. Mass.:
294.738
SMILES:
Clc1cccc(c1)-c1cc(Cn2cncn2)ccc1C#N
: