Target
Mitogen-activated protein kinase 14
Ligand
BDBM50310951
Substrate
Meas. Tech.
ChEMBL_618897 (CHEMBL1101788)
IC50
900±n/a nM
Citation
 Selness, SRDevraj, RVMonahan, JBBoehm, TLWalker, JKDevadas, BDurley, RCKurumbail, RShieh, HXing, LHepperle, MRucker, PVJerome, KDBenson, AGMarrufo, LDMadsen, HMHitchcock, JOwen, TJChristie, LPromo, MAHickory, BSAlvira, ENaing, WBlevis-Bal, R Discovery of N-substituted pyridinones as potent and selective inhibitors of p38 kinase. Bioorg Med Chem Lett 19:5851-6 (2009)  
Target
Name:
Mitogen-activated protein kinase 14
Synonyms:
CSAID-binding protein CSBP1 CSPB1 MAP kinase 14 MAP kinase p38 alpha MAPK14 MK14_HUMAN Mitogen-activated protein kinase p38 alpha Stress-activated protein kinase 2a | p38 MAP kinase alpha/beta
Type:
Serine/threonine-protein kinase
Mol. Mass.:
41286.76
Organism:
Homo sapiens (Human)
Description:
Q16539
Residue:
360
  
Inhibitor
Name:
BDBM50310951
Synonyms:
1-benzyl-4-(benzyloxy)-3-chloropyridin-2(1H)-one | CHEMBL1078021
Type:
Small organic molecule
Emp. Form.:
C19H16ClNO2
Mol. Mass.:
325.789
SMILES:
Clc1c(OCc2ccccc2)ccn(Cc2ccccc2)c1=O
: