Target
Mitogen-activated protein kinase 14
Ligand
BDBM50310960
Substrate
Meas. Tech.
ChEMBL_618897 (CHEMBL1101788)
IC50
9900±n/a nM
Citation
 Selness, SRDevraj, RVMonahan, JBBoehm, TLWalker, JKDevadas, BDurley, RCKurumbail, RShieh, HXing, LHepperle, MRucker, PVJerome, KDBenson, AGMarrufo, LDMadsen, HMHitchcock, JOwen, TJChristie, LPromo, MAHickory, BSAlvira, ENaing, WBlevis-Bal, R Discovery of N-substituted pyridinones as potent and selective inhibitors of p38 kinase. Bioorg Med Chem Lett 19:5851-6 (2009)  
Target
Name:
Mitogen-activated protein kinase 14
Synonyms:
CSAID-binding protein CSBP1 CSPB1 MAP kinase 14 MAP kinase p38 alpha MAPK14 MK14_HUMAN Mitogen-activated protein kinase p38 alpha Stress-activated protein kinase 2a | p38 MAP kinase alpha/beta
Type:
Serine/threonine-protein kinase
Mol. Mass.:
41286.76
Organism:
Homo sapiens (Human)
Description:
Q16539
Residue:
360
  
Inhibitor
Name:
BDBM50310960
Synonyms:
4-(2,4-difluorobenzyloxy)-1-(3-fluorobenzyl)-2-oxo-1,2-dihydropyridine-3-carbonitrile | CHEMBL1078583
Type:
Small organic molecule
Emp. Form.:
C20H13F3N2O2
Mol. Mass.:
370.3246
SMILES:
Fc1ccc(COc2ccn(Cc3cccc(F)c3)c(=O)c2C#N)c(F)c1
: