Target
Mitogen-activated protein kinase 14
Ligand
BDBM50310963
Substrate
Meas. Tech.
ChEMBL_618897 (CHEMBL1101788)
IC50
190±n/a nM
Citation
 Selness, SRDevraj, RVMonahan, JBBoehm, TLWalker, JKDevadas, BDurley, RCKurumbail, RShieh, HXing, LHepperle, MRucker, PVJerome, KDBenson, AGMarrufo, LDMadsen, HMHitchcock, JOwen, TJChristie, LPromo, MAHickory, BSAlvira, ENaing, WBlevis-Bal, R Discovery of N-substituted pyridinones as potent and selective inhibitors of p38 kinase. Bioorg Med Chem Lett 19:5851-6 (2009)  
Target
Name:
Mitogen-activated protein kinase 14
Synonyms:
CSAID-binding protein CSBP1 CSPB1 MAP kinase 14 MAP kinase p38 alpha MAPK14 MK14_HUMAN Mitogen-activated protein kinase p38 alpha Stress-activated protein kinase 2a | p38 MAP kinase alpha/beta
Type:
Serine/threonine-protein kinase
Mol. Mass.:
41286.76
Organism:
Homo sapiens (Human)
Description:
Q16539
Residue:
360
  
Inhibitor
Name:
BDBM50310963
Synonyms:
4-((3-bromo-4-(2,4-difluorobenzyloxy)-6-methyl-2-oxopyridin-1(2H)-yl)methyl)benzonitrile | CHEMBL1078678
Type:
Small organic molecule
Emp. Form.:
C21H15BrF2N2O2
Mol. Mass.:
445.257
SMILES:
Cc1cc(OCc2ccc(F)cc2F)c(Br)c(=O)n1Cc1ccc(cc1)C#N
: