Target
Mitogen-activated protein kinase 14
Ligand
BDBM50310981
Substrate
Meas. Tech.
ChEMBL_618897 (CHEMBL1101788)
IC50
65±n/a nM
Citation
 Selness, SRDevraj, RVMonahan, JBBoehm, TLWalker, JKDevadas, BDurley, RCKurumbail, RShieh, HXing, LHepperle, MRucker, PVJerome, KDBenson, AGMarrufo, LDMadsen, HMHitchcock, JOwen, TJChristie, LPromo, MAHickory, BSAlvira, ENaing, WBlevis-Bal, R Discovery of N-substituted pyridinones as potent and selective inhibitors of p38 kinase. Bioorg Med Chem Lett 19:5851-6 (2009)  
Target
Name:
Mitogen-activated protein kinase 14
Synonyms:
CSAID-binding protein CSBP1 CSPB1 MAP kinase 14 MAP kinase p38 alpha MAPK14 MK14_HUMAN Mitogen-activated protein kinase p38 alpha Stress-activated protein kinase 2a | p38 MAP kinase alpha/beta
Type:
Serine/threonine-protein kinase
Mol. Mass.:
41286.76
Organism:
Homo sapiens (Human)
Description:
Q16539
Residue:
360
  
Inhibitor
Name:
BDBM50310981
Synonyms:
1-(3-(aminomethyl)benzyl)-3-bromo-4-(2,4-difluorobenzyloxy)-6-methylpyridin-2(1H)-one | CHEMBL1079309
Type:
Small organic molecule
Emp. Form.:
C21H19BrF2N2O2
Mol. Mass.:
449.289
SMILES:
Cc1cc(OCc2ccc(F)cc2F)c(Br)c(=O)n1Cc1cccc(CN)c1
: